Reaction Details
Target5-hydroxytryptamine receptor 2B
LigandBDBM16673
Substrate/Competitorn/a
Meas. Tech.ChEMBL_858220 (CHEMBL2167683)
Ki 56±n/a nM
Citation Lin, XHuang, XPChen, GWhaley, RPeng, SWang, YZhang, GWang, SXWang, SRoth, BLHuang, N Life beyond kinases: structure-based discovery of sorafenib as nanomolar antagonist of 5-HT receptors. J Med Chem55:5749-59 (2012) 
 
5-hydroxytryptamine receptor 2B
Name:5-hydroxytryptamine receptor 2B
Type:G Protein-Coupled Receptor (GPCR)
Mol. Mass.:54312.47
Organism:Homo sapiens (Human)
Description:Receptor binding assays were performed using human clone stably expressed in CHO cells.
Residue:481
BDBM16673
NameBDBM16673
Synonyms:4-[4-({[4-chloro-3-(trifluoromethyl)phenyl]carbamoyl}amino)phenoxy]-N-methylpyridine-2-carboxamide BAY 43-9006 BAY439006 Hit compound, 8 Sorafenib US10183928, Sorafenib US10227329, Compound Sorafenib US10774070, Compound Sorafenib US11279688, Compound Sorafenib US9029401, Sorafenib US9902709, Comparative example 1 cid_216239
TypeSmall organic molecule
Emp. Form.C21H16ClF3N4O3
Mol. Mass.464.825
SMILESCNC(=O)c1cc(Oc2ccc(NC(=O)Nc3ccc(Cl)c(c3)C(F)(F)F)cc2)ccn1