Reaction Details
TargetKappa-type opioid receptor
LigandBDBM50395104
Substrate/Competitorn/a
Meas. Tech.ChEMBL_859459 (CHEMBL2167537)
Ki 1.29±n/a nM
Citation Majumdar, SSubrath, JLe Rouzic, VPolikar, LBurgman, MNagakura, KOcampo, JHaselton, NPasternak, ARGrinnell, SPan, YXPasternak, GW Synthesis and evaluation of aryl-naloxamide opiate analgesics targeting truncated exon 11-associatedµ opioid receptor (MOR-1) splice variants. J Med Chem55:6352-62 (2012) 
 
Kappa-type opioid receptor
Name:Kappa-type opioid receptor
Type:Enzyme
Mol. Mass.:42656.78
Organism:Mus musculus (Mouse)
Description:P33534
Residue:380
BDBM50395104
NameBDBM50395104
Synonyms:CHEMBL2164297
TypeSmall organic molecule
Emp. Form.C30H30N2O4
Mol. Mass.482.5702
SMILESOc1ccc2C[C@H]3N(CC=C)CC[C@@]45[C@@H](Oc1c24)[C@@H](CC[C@@]35O)NC(=O)c1ccc2ccccc2c1