Reaction Details
TargetDelta-type opioid receptor
LigandBDBM50395106
Substrate/Competitorn/a
Meas. Tech.ChEMBL_859460 (CHEMBL2167538)
Ki 18.13±n/a nM
Citation Majumdar, SSubrath, JLe Rouzic, VPolikar, LBurgman, MNagakura, KOcampo, JHaselton, NPasternak, ARGrinnell, SPan, YXPasternak, GW Synthesis and evaluation of aryl-naloxamide opiate analgesics targeting truncated exon 11-associatedµ opioid receptor (MOR-1) splice variants. J Med Chem55:6352-62 (2012) 
 
Delta-type opioid receptor
Name:Delta-type opioid receptor
Type:Enzyme Catalytic Domain
Mol. Mass.:40577.25
Organism:MOUSE
Description:P32300
Residue:372
BDBM50395106
NameBDBM50395106
Synonyms:CHEMBL2164295
TypeSmall organic molecule
Emp. Form.C26H27N3O6
Mol. Mass.477.5091
SMILESOc1ccc2C[C@H]3N(CC=C)CC[C@@]45[C@@H](Oc1c24)[C@@H](CC[C@@]35O)NC(=O)c1cccc(c1)[N+]([O-])=O