Reaction Details
TargetDelta-type opioid receptor
LigandBDBM50395107
Substrate/Competitorn/a
Meas. Tech.ChEMBL_859460 (CHEMBL2167538)
Ki 11.25±n/a nM
Citation Majumdar, SSubrath, JLe Rouzic, VPolikar, LBurgman, MNagakura, KOcampo, JHaselton, NPasternak, ARGrinnell, SPan, YXPasternak, GW Synthesis and evaluation of aryl-naloxamide opiate analgesics targeting truncated exon 11-associatedµ opioid receptor (MOR-1) splice variants. J Med Chem55:6352-62 (2012) 
 
Delta-type opioid receptor
Name:Delta-type opioid receptor
Type:Enzyme Catalytic Domain
Mol. Mass.:40577.25
Organism:MOUSE
Description:P32300
Residue:372
BDBM50395107
NameBDBM50395107
Synonyms:CHEMBL2163546
TypeSmall organic molecule
Emp. Form.C26H28N2O5
Mol. Mass.448.5109
SMILESOc1cccc(c1)C(=O)N[C@@H]1CC[C@@]2(O)[C@H]3Cc4ccc(O)c5O[C@@H]1[C@]2(CCN3CC=C)c45