Reaction Details
TargetCannabinoid receptor 2
LigandBDBM50395151
Substrate/Competitorn/a
Meas. Tech.ChEMBL_859793 (CHEMBL2169621)
Ki 9.12±n/a nM
Citation Baraldi, PGSaponaro, GMoorman, ARRomagnoli, RPreti, DBaraldi, SRuggiero, EVarani, KTarga, MVincenzi, FBorea, PAAghazadeh Tabrizi, M 7-Oxo-[1,4]oxazino[2,3,4-ij]quinoline-6-carboxamides as selective CB(2) cannabinoid receptor ligands: structural investigations around a novel class of full agonists. J Med Chem55:6608-23 (2012) 
 
Cannabinoid receptor 2
Name:Cannabinoid receptor 2
Type:Enzyme
Mol. Mass.:39366.68
Organism:Rattus norvegicus (Rat)
Description:Q9QZN9
Residue:360
BDBM50395151
NameBDBM50395151
Synonyms:CHEMBL2163948
TypeSmall organic molecule
Emp. Form.C25H30N2O4
Mol. Mass.422.5167
SMILESCCC1COc2c(OC)ccc3c2n1cc(C(=O)NC12CC4CC(CC(C4)C1)C2)c3=O