Reaction Details
TargetCannabinoid receptor 1
LigandBDBM50395160
Substrate/Competitorn/a
Meas. Tech.ChEMBL_859794 (CHEMBL2169622)
Ki 476±n/a nM
Citation Baraldi, PGSaponaro, GMoorman, ARRomagnoli, RPreti, DBaraldi, SRuggiero, EVarani, KTarga, MVincenzi, FBorea, PAAghazadeh Tabrizi, M 7-Oxo-[1,4]oxazino[2,3,4-ij]quinoline-6-carboxamides as selective CB(2) cannabinoid receptor ligands: structural investigations around a novel class of full agonists. J Med Chem55:6608-23 (2012) 
 
Cannabinoid receptor 1
Name:Cannabinoid receptor 1
Type:G Protein-Coupled Receptor (GPCR)
Mol. Mass.:52856.55
Organism:Rattus norvegicus (rat)
Description:P20272
Residue:473
BDBM50395160
NameBDBM50395160
Synonyms:CHEMBL2163938
TypeSmall organic molecule
Emp. Form.C27H34N2O3
Mol. Mass.434.5705
SMILESCCCC1COc2cccc3c2n1cc(C(=O)NC12CC4CC(C)(CC(C)(C4)C1)C2)c3=O