Reaction Details
TargetCannabinoid receptor 2
LigandBDBM50395162
Substrate/Competitorn/a
Meas. Tech.ChEMBL_859792 (CHEMBL2169620)
Ki 0.32±n/a nM
Citation Baraldi, PGSaponaro, GMoorman, ARRomagnoli, RPreti, DBaraldi, SRuggiero, EVarani, KTarga, MVincenzi, FBorea, PAAghazadeh Tabrizi, M 7-Oxo-[1,4]oxazino[2,3,4-ij]quinoline-6-carboxamides as selective CB(2) cannabinoid receptor ligands: structural investigations around a novel class of full agonists. J Med Chem55:6608-23 (2012) 
 
Cannabinoid receptor 2
Name:Cannabinoid receptor 2
Type:G Protein-Coupled Receptor (GPCR)
Mol. Mass.:39690.94
Organism:Homo sapiens (Human)
Description:P34972
Residue:360
BDBM50395162
NameBDBM50395162
Synonyms:CHEMBL2163935
TypeSmall organic molecule
Emp. Form.C21H26N2O3
Mol. Mass.354.4427
SMILESCCCC1COc2cccc3c2n1cc(C(=O)NC1CCCCC1)c3=O