Reaction Details
TargetCannabinoid receptor 2
LigandBDBM50395166
Substrate/Competitorn/a
Meas. Tech.ChEMBL_859792 (CHEMBL2169620)
Ki 15.8±n/a nM
Citation Baraldi, PGSaponaro, GMoorman, ARRomagnoli, RPreti, DBaraldi, SRuggiero, EVarani, KTarga, MVincenzi, FBorea, PAAghazadeh Tabrizi, M 7-Oxo-[1,4]oxazino[2,3,4-ij]quinoline-6-carboxamides as selective CB(2) cannabinoid receptor ligands: structural investigations around a novel class of full agonists. J Med Chem55:6608-23 (2012) 
 
Cannabinoid receptor 2
Name:Cannabinoid receptor 2
Type:G Protein-Coupled Receptor (GPCR)
Mol. Mass.:39690.94
Organism:Homo sapiens (Human)
Description:P34972
Residue:360
BDBM50395166
NameBDBM50395166
Synonyms:CHEMBL2163931
TypeSmall organic molecule
Emp. Form.C21H28N2O3
Mol. Mass.356.4586
SMILESCCC1COc2cccc3c2n1cc(C(=O)NC(C)CCC(C)C)c3=O