Reaction Details
TargetCannabinoid receptor 1
LigandBDBM50350156
Substrate/Competitorn/a
Meas. Tech.ChEMBL_859791 (CHEMBL2169619)
Ki 689±n/a nM
Citation Baraldi, PGSaponaro, GMoorman, ARRomagnoli, RPreti, DBaraldi, SRuggiero, EVarani, KTarga, MVincenzi, FBorea, PAAghazadeh Tabrizi, M 7-Oxo-[1,4]oxazino[2,3,4-ij]quinoline-6-carboxamides as selective CB(2) cannabinoid receptor ligands: structural investigations around a novel class of full agonists. J Med Chem55:6608-23 (2012) 
 
Cannabinoid receptor 1
Name:Cannabinoid receptor 1
Type:G Protein-Coupled Receptor (GPCR)
Mol. Mass.:52868.96
Organism:Homo sapiens (Human)
Description:P21554
Residue:472
BDBM50350156
NameBDBM50350156
Synonyms:CHEMBL1814463
TypeSmall organic molecule
Emp. Form.C24H28N2O3
Mol. Mass.392.4907
SMILESCCC1COc2cccc3c2n1cc(C(=O)NC12CC4CC(CC(C4)C1)C2)c3=O