Reaction Details
TargetNeuronal acetylcholine receptor subunit alpha-7
LigandBDBM50151495
Substrate/Competitorn/a
Meas. Tech.ChEMBL_860160 (CHEMBL2168701)
Ki>2000±n/a nM
Citation Ondachi, PCastro, ALuetje, CWDamaj, MIMascarella, SWNavarro, HACarroll, FI Synthesis and nicotinic acetylcholine receptor in vitro and in vivo pharmacological properties of 2'-fluoro-3'-(substituted phenyl)deschloroepibatidine analogues of 2'-fluoro-3'-(4-nitrophenyl)deschloroepibatidine. J Med Chem55:6512-22 (2012) 
 
Neuronal acetylcholine receptor subunit alpha-7
Name:Neuronal acetylcholine receptor subunit alpha-7
Type:Enzyme
Mol. Mass.:56502.44
Organism:Rattus norvegicus (Rat)
Description:Q05941
Residue:502
BDBM50151495
NameBDBM50151495
Synonyms:2-[6-Fluoro-5-(4-nitro-phenyl)-pyridin-3-yl]-7-aza-bicyclo[2.2.1]heptane | CHEMBL361465
TypeSmall organic molecule
Emp. Form.C17H16FN3O2
Mol. Mass.313.3262
SMILES[O-][N+](=O)c1ccc(cc1)-c1cc(cnc1F)C1CC2CCC1N2