Reaction Details
TargetSodium channel protein type 9 subunit alpha
LigandBDBM50017659
Substrate/Competitorn/a
Meas. Tech.ChEMBL_860772 (CHEMBL2168492)
IC50 110±n/a nM
Citation Macsari, IBesidski, YCsjernyik, GNilsson, LISandberg, LYngve, UAhlin, KBueters, TEriksson, ABLund, PEVenyike, EOerther, SHygge Blakeman, KLuo, LArvidsson, PI 3-Oxoisoindoline-1-carboxamides: potent, state-dependent blockers of voltage-gated sodium channel Na(V)1.7 with efficacy in rat pain models. J Med Chem55:6866-80 (2012) 
 
Sodium channel protein type 9 subunit alpha
Name:Sodium channel protein type 9 subunit alpha
Type:Protein
Mol. Mass.:226375.97
Organism:Homo sapiens (Human)
Description:Q15858
Residue:1988
BDBM50017659
NameBDBM50017659
Synonyms:2-(Dimethylamino)ethyl p-(butylamino)benzoate CHEMBL698 TETRACAINE | p-Butylaminobenzoyl-2-dimethylaminoethanol
TypeSmall organic molecule
Emp. Form.C15H24N2O2
Mol. Mass.264.3633
SMILESCCCCNc1ccc(cc1)C(=O)OCCN(C)C