Reaction Details
TargetSodium channel protein type 9 subunit alpha
LigandBDBM50395373
Substrate/Competitorn/a
Meas. Tech.ChEMBL_860772 (CHEMBL2168492)
IC50 64±n/a nM
Citation Macsari, IBesidski, YCsjernyik, GNilsson, LISandberg, LYngve, UAhlin, KBueters, TEriksson, ABLund, PEVenyike, EOerther, SHygge Blakeman, KLuo, LArvidsson, PI 3-Oxoisoindoline-1-carboxamides: potent, state-dependent blockers of voltage-gated sodium channel Na(V)1.7 with efficacy in rat pain models. J Med Chem55:6866-80 (2012) 
 
Sodium channel protein type 9 subunit alpha
Name:Sodium channel protein type 9 subunit alpha
Type:Protein
Mol. Mass.:226375.97
Organism:Homo sapiens (Human)
Description:Q15858
Residue:1988
BDBM50395373
NameBDBM50395373
Synonyms:CHEMBL2164041
TypeSmall organic molecule
Emp. Form.C24H20F3N3O4
Mol. Mass.471.4285
SMILESOc1cccc2C(N(CCc3ccccn3)C(=O)c12)C(=O)NCc1ccc(OC(F)(F)F)cc1