Reaction Details
TargetSodium channel protein type 9 subunit alpha
LigandBDBM50395364
Substrate/Competitorn/a
Meas. Tech.ChEMBL_860772 (CHEMBL2168492)
IC50 330±n/a nM
Citation Macsari, IBesidski, YCsjernyik, GNilsson, LISandberg, LYngve, UAhlin, KBueters, TEriksson, ABLund, PEVenyike, EOerther, SHygge Blakeman, KLuo, LArvidsson, PI 3-Oxoisoindoline-1-carboxamides: potent, state-dependent blockers of voltage-gated sodium channel Na(V)1.7 with efficacy in rat pain models. J Med Chem55:6866-80 (2012) 
 
Sodium channel protein type 9 subunit alpha
Name:Sodium channel protein type 9 subunit alpha
Type:Protein
Mol. Mass.:226375.97
Organism:Homo sapiens (Human)
Description:Q15858
Residue:1988
BDBM50395364
NameBDBM50395364
Synonyms:CHEMBL2164374
TypeSmall organic molecule
Emp. Form.C27H30F3N3O5
Mol. Mass.533.5394
SMILESCC(C)(C)OC(=O)N1CCC(CC1)N1C(C(=O)NCc2ccc(OC(F)(F)F)cc2)c2ccccc2C1=O