Reaction Details
TargetSodium channel protein type 5 subunit alpha
LigandBDBM50395347
Substrate/Competitorn/a
Meas. Tech.ChEMBL_860770 (CHEMBL2168490)
IC50>31000±n/a nM
Citation Macsari, IBesidski, YCsjernyik, GNilsson, LISandberg, LYngve, UAhlin, KBueters, TEriksson, ABLund, PEVenyike, EOerther, SHygge Blakeman, KLuo, LArvidsson, PI 3-Oxoisoindoline-1-carboxamides: potent, state-dependent blockers of voltage-gated sodium channel Na(V)1.7 with efficacy in rat pain models. J Med Chem55:6866-80 (2012) 
 
Sodium channel protein type 5 subunit alpha
Name:Sodium channel protein type 5 subunit alpha
Type:Enzyme
Mol. Mass.:226908.60
Organism:Homo sapiens (Human)
Description:Q14524
Residue:2016
BDBM50395347
NameBDBM50395347
Synonyms:CHEMBL2164367
TypeSmall organic molecule
Emp. Form.C25H22F3N3O3
Mol. Mass.469.4557
SMILESCC1(N(CCc2ccccn2)C(=O)c2ccccc12)C(=O)NCc1ccc(OC(F)(F)F)cc1