Reaction Details
TargetS-methylmethionine--homocysteine S-methyltransferase BHMT2
LigandBDBM50395382
Substrate/Competitorn/a
Meas. Tech.ChEMBL_857979 (CHEMBL2166487)
Ki 77±n/a nM
Citation Mládková, JVanek, VBudešínský, MElbert, TDemianová, ZGarrow, TAJirácek, J Double-headed sulfur-linked amino acids as first inhibitors for betaine-homocysteine S-methyltransferase 2. J Med Chem55:6822-31 (2012) 
 
S-methylmethionine--homocysteine S-methyltransferase BHMT2
Name:S-methylmethionine--homocysteine S-methyltransferase BHMT2
Type:PROTEIN
Mol. Mass.:40349.19
Organism:Homo sapiens (Human)
Description:ChEMBL_857981
Residue:363
BDBM50395382
NameBDBM50395382
Synonyms:CHEMBL2164724
TypeSmall organic molecule
Emp. Form.C12H24N2O4S
Mol. Mass.292.395
SMILESCC(CCSCC[C@H](N)C(O)=O)CCC(N)C(O)=O