Reaction Details
TargetBetaine--homocysteine S-methyltransferase 1
LigandBDBM50395382
Substrate/Competitorn/a
Meas. Tech.ChEMBL_857980 (CHEMBL2166488)
IC50 76600±n/a nM
Citation Mládková, JVanek, VBudešínský, MElbert, TDemianová, ZGarrow, TAJirácek, J Double-headed sulfur-linked amino acids as first inhibitors for betaine-homocysteine S-methyltransferase 2. J Med Chem55:6822-31 (2012) 
 
Betaine--homocysteine S-methyltransferase 1
Name:Betaine--homocysteine S-methyltransferase 1
Type:PROTEIN
Mol. Mass.:45000.99
Organism:Homo sapiens (Human)
Description:ChEMBL_970672
Residue:406
BDBM50395382
NameBDBM50395382
Synonyms:CHEMBL2164724
TypeSmall organic molecule
Emp. Form.C12H24N2O4S
Mol. Mass.292.395
SMILESCC(CCSCC[C@H](N)C(O)=O)CCC(N)C(O)=O