Reaction Details
TargetCytochrome P450 11B1, mitochondrial
LigandBDBM50395455
Substrate/Competitorn/a
Meas. Tech.ChEMBL_858497 (CHEMBL2169296)
IC50 10.3±n/a nM
Citation Yin, LLucas, SMaurer, FKazmaier, UHu, QHartmann, RW Novel imidazol-1-ylmethyl substituted 1,2,5,6-tetrahydropyrrolo[3,2,1-ij]quinolin-4-ones as potent and selective CYP11B1 inhibitors for the treatment of Cushing's syndrome. J Med Chem55:6629-33 (2012) 
 
Cytochrome P450 11B1, mitochondrial
Name:Cytochrome P450 11B1, mitochondrial
Type:Enzyme
Mol. Mass.:57591.44
Organism:Homo sapiens (Human)
Description:P15538
Residue:503
BDBM50395455
NameBDBM50395455
Synonyms:CHEMBL2163639
TypeSmall organic molecule
Emp. Form.C18H19N3O
Mol. Mass.293.363
SMILESO=C1CCc2cc(cc3CCN1c23)C(C1CC1)n1ccnc1