Reaction Details
TargetHistamine H1 receptor
LigandBDBM50240514
Substrate/Competitorn/a
Meas. Tech.ChEMBL_858530 (CHEMBL2169534)
IC50 1.000±n/a nM
Citation Vasudevan, SRMoore, JBSchymura, YChurchill, GC Shape-based reprofiling of FDA-approved drugs for the H1 histamine receptor. J Med Chem55:7054-60 (2012) 
 
Histamine H1 receptor
Name:Histamine H1 receptor
Type:G Protein-Coupled Receptor (GPCR)
Mol. Mass.:55808.72
Organism:Homo sapiens (Human)
Description:Cell pellets from SK-N-MC cells transfected with human H1 receptor were used in binding assay.
Residue:487
BDBM50240514
NameBDBM50240514
Synonyms:(3Z)-3-(2-chloro-9H-thioxanthen-9-ylidene)-N,N-dimethylpropan-1-amine (Z)-chlorprothixene CHLORPROTHIXENE | cis-2-Chloro-9-(3-dimethylaminopropylidene)thioxanthene
TypeSmall organic molecule
Emp. Form.C18H18ClNS
Mol. Mass.315.86
SMILESCN(C)CC\C=C1\c2ccccc2Sc2ccc(Cl)cc12