Reaction Details
TargetCorticotropin-releasing factor receptor 1
LigandBDBM50395822
Substrate/Competitorn/a
Meas. Tech.ChEMBL_860644 (CHEMBL2167784)
Ki 2±n/a nM
Citation Deskus, JADischino, DDMattson, RJDitta, JLParker, MFDenhart, DJZuev, DHuang, HHartz, RAAhuja, VTWong, HMattson, GKMolski, TFGrace, JEZueva, LNielsen, JMDulac, HLi, YWGuaraldi, MAzure, MOnthank, DHayes, MWexler, EMcDonald, JLodge, NJBronson, JJMacor, JE [18F](R)-5-chloro-1-(1-cyclopropyl-2-methoxyethyl)-3-(4-(2-fluoroethoxy)-2,5-dimethyl phenylamino)pyrazin-2(1H)-one: introduction of N3-phenylpyrazinones as potential CRF-R1 PET imaging agents. Bioorg Med Chem Lett22:6651-5 (2012) 
 
Corticotropin-releasing factor receptor 1
Name:Corticotropin-releasing factor receptor 1
Type:Enzyme
Mol. Mass.:50744.31
Organism:Homo sapiens (Human)
Description:P34998
Residue:444
BDBM50395822
NameBDBM50395822
Synonyms:CHEMBL1762817
TypeSmall organic molecule
Emp. Form.C19H23BrClN5O2
Mol. Mass.468.775
SMILESCOCCN(CCOC)c1nc(C)nc2c(c(C)nn12)-c1ccc(Br)cc1Cl