Reaction Details
TargetProtein kinase C alpha type
LigandBDBM50395892
Substrate/Competitorn/a
Meas. Tech.ChEMBL_858036 (CHEMBL2166772)
Ki>1000000±n/a nM
Citation Tell, VHolzer, MHerrmann, LMahmoud, KASchächtele, CTotzke, FHilgeroth, A Multitargeted drug development: Discovery and profiling of dihydroxy substituted 1-aza-9-oxafluorenes as lead compounds targeting Alzheimer disease relevant kinases. Bioorg Med Chem Lett22:6914-8 (2012) 
 
Protein kinase C alpha type
Name:Protein kinase C alpha type
Type:Enzyme
Mol. Mass.:76755.65
Organism:Homo sapiens (Human)
Description:The recombinant human PKC enzymes were produced using a baculovirus expression system in SF9 cells
Residue:672
BDBM50395892
NameBDBM50395892
Synonyms:CHEMBL2163772
TypeSmall organic molecule
Emp. Form.C17H11NO3
Mol. Mass.277.2741
SMILESOc1ccc2oc3ncc(O)c(-c4ccccc4)c3c2c1