Reaction Details
TargetCyclin-dependent kinase 2/G1/S-specific cyclin-E1/G1/S-specific cyclin-E2
LigandBDBM50395893
Substrate/Competitorn/a
Meas. Tech.ChEMBL_858049 (CHEMBL2166785)
Ki 6400±n/a nM
Citation Tell, VHolzer, MHerrmann, LMahmoud, KASchächtele, CTotzke, FHilgeroth, A Multitargeted drug development: Discovery and profiling of dihydroxy substituted 1-aza-9-oxafluorenes as lead compounds targeting Alzheimer disease relevant kinases. Bioorg Med Chem Lett22:6914-8 (2012) 
 
Cyclin-dependent kinase 2/G1/S-specific cyclin-E1/G1/S-specific cyclin-E2
Name:Cyclin-dependent kinase 2/G1/S-specific cyclin-E1/G1/S-specific cyclin-E2
Type:n/a
Mol. Mass.:n/a
Description:ASSAY_ID of EBI is 52510
Components:This complex has 3 components.
Component 1
Name:G1/S-specific cyclin-E2
Synonyms:CCNE2 CDK3/cyclin E | G1/S-specific cyclin-E2
Type:PROTEIN
Mol. Mass.:46763.82
Organism:Homo sapiens (Human)
Description:EBI_10135
Residue:404
Component 2
Name:Cyclin-dependent kinase 2
Synonyms:CDK2 CDK2_HUMAN Cell division protein kinase 2 Protein cereblon/Cyclin-dependent kinase 2 | p33 protein kinase
Type:Enzyme Subunit
Mol. Mass.:33938.17
Organism:Homo sapiens (Human)
Description:P24941
Residue:298
Component 3
Name:G1/S-specific cyclin-E1
Synonyms:CCNE CCNE1_HUMAN
Type:Enzyme Subunit
Mol. Mass.:47073.17
Organism:Homo sapiens (Human)
Description:n/a
Residue:410
BDBM50395893
NameBDBM50395893
Synonyms:CHEMBL1165662
TypeSmall organic molecule
Emp. Form.C24H17NO3
Mol. Mass.367.3967
SMILESOc1ccc2oc3ncc(OCc4ccccc4)c(-c4ccccc4)c3c2c1