Reaction Details
TargetGlycogen synthase kinase-3 beta
LigandBDBM50395891
Substrate/Competitorn/a
Meas. Tech.ChEMBL_858033 (CHEMBL2166769)
Ki>1000000±n/a nM
Citation Tell, VHolzer, MHerrmann, LMahmoud, KASchächtele, CTotzke, FHilgeroth, A Multitargeted drug development: Discovery and profiling of dihydroxy substituted 1-aza-9-oxafluorenes as lead compounds targeting Alzheimer disease relevant kinases. Bioorg Med Chem Lett22:6914-8 (2012) 
 
Glycogen synthase kinase-3 beta
Name:Glycogen synthase kinase-3 beta
Type:Enzyme
Mol. Mass.:46756.38
Organism:Homo sapiens (Human)
Description:P49841
Residue:420
BDBM50395891
NameBDBM50395891
Synonyms:CHEMBL2163773
TypeSmall organic molecule
Emp. Form.C19H15NO3
Mol. Mass.305.3273
SMILESCOc1ccc2oc3ncc(OC)c(-c4ccccc4)c3c2c1