Reaction Details
TargetMuscarinic acetylcholine receptor M2
LigandBDBM50395966
Substrate/Competitorn/a
Meas. Tech.ChEMBL_858565 (CHEMBL2166010)
IC50>1500±n/a nM
Citation Poslusney, MSSevel, CUtley, TJBridges, TMMorrison, RDKett, NRSheffler, DJNiswender, CMDaniels, JSConn, PJLindsley, CWWood, MR Synthesis and biological characterization of a series of novel diaryl amide M1 antagonists. Bioorg Med Chem Lett22:6923-8 (2012) 
 
Muscarinic acetylcholine receptor M2
Name:Muscarinic acetylcholine receptor M2
Type:GPCR
Mol. Mass.:51730.61
Organism:Homo sapiens (Human)
Description:P08172
Residue:466
BDBM50395966
NameBDBM50395966
Synonyms:CHEMBL2164905
TypeSmall organic molecule
Emp. Form.C20H23FN2O
Mol. Mass.326.4078
SMILESCN1CCN(CC1)C(=O)[C@@](F)(Cc1ccccc1)c1ccccc1