Reaction Details
Target5-hydroxytryptamine receptor 2C
LigandBDBM50086056
Substrate/Competitorn/a
Meas. Tech.ChEMBL_861531 (CHEMBL2174379)
IC50 10±n/a nM
Citation Calderón, FVidal-Mas, JBurrows, Jde la Rosa, JCJiménez-Díaz, MBMulet, TPrats, SSolana, JWitty, MGamo, FJFernández, E A Divergent SAR Study Allows Optimization of a Potent 5-HT2c Inhibitor to a Promising Antimalarial Scaffold. ACS Med Chem Lett3:373-377 (2012) 
 
5-hydroxytryptamine receptor 2C
Name:5-hydroxytryptamine receptor 2C
Type:G Protein-Coupled Receptor (GPCR)
Mol. Mass.:51836.79
Organism:Homo sapiens (Human)
Description:P28335
Residue:458
BDBM50086056
NameBDBM50086056
Synonyms:5-Methoxy-6-trifluoromethyl-2,3-dihydro-indole-1-carboxylic acid (3-fluoro-5-pyridin-3-yl-phenyl)-amide | CHEMBL14276
TypeSmall organic molecule
Emp. Form.C22H17F4N3O2
Mol. Mass.431.3829
SMILESCOc1cc2CCN(C(=O)Nc3cc(F)cc(c3)-c3cccnc3)c2cc1C(F)(F)F