Reaction Details
TargetNAD-dependent protein deacetylase sirtuin-1
LigandBDBM50178769
Substrate/Competitorn/a
Meas. Tech.ChEMBL_861571 (CHEMBL2174512)
IC50 100±n/a nM
Citation Blum, CAEllis, JLLoh, CNg, PYPerni, RBStein, RL SIRT1 modulation as a novel approach to the treatment of diseases of aging. J Med Chem54:417-32 (2011) 
 
NAD-dependent protein deacetylase sirtuin-1
Name:NAD-dependent protein deacetylase sirtuin-1
Type:Developmental protein; hydrolase
Mol. Mass.:81626.66
Organism:Homo sapiens (Human)
Description:n/a
Residue:747
BDBM50178769
NameBDBM50178769
Synonyms:(+/-)-6-chloro-2,3,4,9-tetrahydro-1H-carbazole-1-carboxamide CHEMBL420311
TypeSmall organic molecule
Emp. Form.C13H13ClN2O
Mol. Mass.248.708
SMILESNC(=O)C1CCCc2c1[nH]c1ccc(Cl)cc21