Reaction Details
TargetTyrosine-protein kinase Lck
LigandBDBM50396071
Substrate/Competitorn/a
Meas. Tech.ChEMBL_861790 (CHEMBL2173383)
Ki 116±n/a nM
Citation Singh, RMasuda, ESPayan, DG Discovery and development of spleen tyrosine kinase (SYK) inhibitors. J Med Chem55:3614-43 (2012) 
 
Tyrosine-protein kinase Lck
Name:Tyrosine-protein kinase Lck
Type:n/a
Mol. Mass.:57987.83
Organism:Homo sapiens (Human)
Description:P06239
Residue:509
BDBM50396071
NameBDBM50396071
Synonyms:CHEMBL2170582 | US10828301, Compound R921303
TypeSmall organic molecule
Emp. Form.C21H17F3N6O4
Mol. Mass.474.3927
SMILESCNC(=O)COc1cccc(Nc2ncc(F)c(Nc3ccc4OC(F)(F)C(=O)Nc4c3)n2)c1