Reaction Details
TargetTyrosine-protein kinase SYK
LigandBDBM50126414
Substrate/Competitorn/a
Meas. Tech.ChEMBL_861815 (CHEMBL2173408)
IC50 1200±n/a nM
Citation Singh, RMasuda, ESPayan, DG Discovery and development of spleen tyrosine kinase (SYK) inhibitors. J Med Chem55:3614-43 (2012) 
 
Tyrosine-protein kinase SYK
Name:Tyrosine-protein kinase SYK
Type:Enzyme
Mol. Mass.:72079.99
Organism:Homo sapiens (Human)
Description:P43405
Residue:635
BDBM50126414
NameBDBM50126414
Synonyms:CHEMBL30240 N1-(7-(4-chlorophenyl)-1,6-naphthyridin-5-yl)propane-1,3-diamine
TypeSmall organic molecule
Emp. Form.C17H17ClN4
Mol. Mass.312.797
SMILESNCCCNc1nc(cc2ncccc12)-c1ccc(Cl)cc1