Reaction Details
TargetTyrosine-protein kinase SYK
LigandBDBM13530
Substrate/Competitorn/a
Meas. Tech.ChEMBL_861815 (CHEMBL2173408)
Ki 5000±n/a nM
Citation Singh, RMasuda, ESPayan, DG Discovery and development of spleen tyrosine kinase (SYK) inhibitors. J Med Chem55:3614-43 (2012) 
 
Tyrosine-protein kinase SYK
Name:Tyrosine-protein kinase SYK
Type:Enzyme
Mol. Mass.:72079.99
Organism:Homo sapiens (Human)
Description:P43405
Residue:635
BDBM13530
NameBDBM13530
Synonyms:4-[(4-methylpiperazin-1-yl)methyl]-N-[4-methyl-3-[(4-pyridin-3-ylpyrimidin-2-yl)amino]phenyl]benzamide Gleevec Imatinib, 21 STI-571 US10906896, Cpd imatinib US11725005, Compound imatinib cid_5291 med.21724, Compound 6
TypeSmall organic molecule
Emp. Form.C29H31N7O
Mol. Mass.493.6027
SMILESCN1CCN(Cc2ccc(cc2)C(=O)Nc2ccc(C)c(Nc3nccc(n3)-c3cccnc3)c2)CC1