Reaction Details
TargetGlucose-dependent insulinotropic receptor
LigandBDBM50396141
Substrate/Competitorn/a
Meas. Tech.ChEMBL_862589 (CHEMBL2173985)
Ki 20±n/a nM
Citation St Jean, DJFotsch, C Mitigating heterocycle metabolism in drug discovery. J Med Chem55:6002-20 (2012) 
 
Glucose-dependent insulinotropic receptor
Name:Glucose-dependent insulinotropic receptor
Type:Protein
Mol. Mass.:36901.49
Organism:Homo sapiens (Human)
Description:Q8TDV5
Residue:335
BDBM50396141
NameBDBM50396141
Synonyms:CHEMBL2171708
TypeSmall organic molecule
Emp. Form.C22H28N4O5
Mol. Mass.428.4815
SMILESCC(C)OC(=O)N1C[C@@H]2COC[C@H](C1)[C@@H]2Oc1ncnc(Oc2cccnc2C)c1C