Reaction Details
Target5-hydroxytryptamine receptor 1A
LigandBDBM50396143
Substrate/Competitorn/a
Meas. Tech.ChEMBL_862587 (CHEMBL2173907)
Ki 0.851±n/a nM
Citation St Jean, DJFotsch, C Mitigating heterocycle metabolism in drug discovery. J Med Chem55:6002-20 (2012) 
 
5-hydroxytryptamine receptor 1A
Name:5-hydroxytryptamine receptor 1A
Type:n/a
Mol. Mass.:46122.49
Organism:Homo sapiens (Human)
Description:n/a
Residue:422
BDBM50396143
NameBDBM50396143
Synonyms:CHEMBL300739
TypeSmall organic molecule
Emp. Form.C22H22FNO3
Mol. Mass.367.4134
SMILESO[C@H]1[C@@H](Cc2cc(F)ccc12)N1CCC(=CC1)c1cccc2OCCOc12