Reaction Details
TargetProstate-specific antigen
LigandBDBM50396162
Substrate/Competitorn/a
Meas. Tech.ChEMBL_862794 (CHEMBL2172814)
Ki 300±n/a nM
Citation Caliendo, GSantagada, VPerissutti, ESeverino, BFiorino, FFrecentese, FJuliano, L Kallikrein protease activated receptor (PAR) axis: an attractive target for drug development. J Med Chem55:6669-86 (2012) 
 
Prostate-specific antigen
Name:Prostate-specific antigen
Type:PROTEIN
Mol. Mass.:28747.53
Organism:Homo sapiens (Human)
Description:ChEMBL_959198
Residue:261
BDBM50396162
NameBDBM50396162
Synonyms:CHEMBL2171878
TypeSmall organic molecule
Emp. Form.C15H10N2O4
Mol. Mass.282.2509
SMILESCc1c(cccc1[N+]([O-])=O)-c1nc2ccccc2c(=O)o1