Reaction Details
TargetKallikrein-1
LigandBDBM50396166
Substrate/Competitorn/a
Meas. Tech.ChEMBL_862798 (CHEMBL2172818)
Ki 50±n/a nM
Citation Caliendo, GSantagada, VPerissutti, ESeverino, BFiorino, FFrecentese, FJuliano, L Kallikrein protease activated receptor (PAR) axis: an attractive target for drug development. J Med Chem55:6669-86 (2012) 
 
Kallikrein-1
Name:Kallikrein-1
Type:Enzyme
Mol. Mass.:28874.69
Organism:Homo sapiens (Human)
Description:P06870
Residue:262
BDBM50396166
NameBDBM50396166
Synonyms:CHEMBL2171749
TypeSmall organic molecule
Emp. Form.C48H67N15O12
Mol. Mass.1046.1389
SMILESNCC1CCC(C[C@H](NC(=O)[C@H](Cc2ccccc2)NC(=O)c2ccccc2N)C(=O)N[C@@H](CO)C(=O)N[C@@H](CCCN=C(N)N)C(=O)N[C@@H](CCC(N)=O)C(=O)NCCNc2ccc(cc2[N+]([O-])=O)[N+]([O-])=O)CC1