Reaction Details
TargetC-C chemokine receptor type 6
LigandBDBM50396184
Substrate/Competitorn/a
Meas. Tech.ChEMBL_863154 (CHEMBL2175765)
IC50 261±n/a nM
Citation Cui, LLi, JXie, X Rediocide A, an Insecticide, induces G-protein-coupled receptor desensitization via activation of conventional protein kinase C. J Nat Prod75:1058-62 (2012) 
 
C-C chemokine receptor type 6
Name:C-C chemokine receptor type 6
Type:Enzyme
Mol. Mass.:42510.84
Organism:Homo sapiens (Human)
Description:P51684
Residue:374
BDBM50396184
NameBDBM50396184
Synonyms:REDIOCIDE A
TypeSmall organic molecule
Emp. Form.C44H58O13
Mol. Mass.794.9235
SMILESCC(C)CC(=O)O[C@H]1\C=C\C=C\C(=O)O[C@H]2[C@@H](C)C[C@@H]3[C@]2(O)[C@H](O)[C@@]2(CO)O[C@H]2[C@H]2[C@H]4OC5(O[C@@H]([C@@H](C)[C@]32O5)[C@@]4(O)[C@](C)(O)C[C@H]2CC[C@H]1[C@H]2C)c1ccccc1