Reaction Details
TargetSodium/hydrogen exchanger 1
LigandBDBM50396472
Substrate/Competitorn/a
Meas. Tech.ChEMBL_862405 (CHEMBL2173435)
IC50 16±n/a nM
Citation Huber, JDBentzien, JBoyer, SJBurke, JDe Lombaert, SEickmeier, CGuo, XHaist, JVHickey, ERKaplita, PKarmazyn, MKemper, RKennedy, CAKirrane, TMadwed, JBMainolfi, ENagaraja, NSoleymanzadeh, FSwinamer, AEldrup, AB Identification of a potent sodium hydrogen exchanger isoform 1 (NHE1) inhibitor with a suitable profile for chronic dosing and demonstrated cardioprotective effects in a preclinical model of myocardial infarction in the rat. J Med Chem55:7114-40 (2012) 
 
Sodium/hydrogen exchanger 1
Name:Sodium/hydrogen exchanger 1
Type:PROTEIN
Mol. Mass.:90771.96
Organism:Homo sapiens (Human)
Description:ChEMBL_862405
Residue:815
BDBM50396472
NameBDBM50396472
Synonyms:CHEMBL2170607
TypeSmall organic molecule
Emp. Form.C18H21F3N4O2
Mol. Mass.382.3801
SMILESNC(=N)NC(=O)c1ccc(C2CCN(CC2)C(=O)C2CC2)c(c1)C(F)(F)F