Reaction Details
TargetRAF proto-oncogene serine/threonine-protein kinase
LigandBDBM25617
Substrate/Competitorn/a
Meas. Tech.ChEMBL_862423 (CHEMBL2173453)
Ki 3.3±n/a nM
Citation Wang, XKim, J Conformation-specific effects of Raf kinase inhibitors. J Med Chem55:7332-41 (2012) 
 
RAF proto-oncogene serine/threonine-protein kinase
Name:RAF proto-oncogene serine/threonine-protein kinase
Type:Serine/threonine-protein kinase
Mol. Mass.:73082.52
Organism:Homo sapiens (Human)
Description:P04049
Residue:648
BDBM25617
NameBDBM25617
Synonyms:N-[3-({5-chloro-1H-pyrrolo[2,3-b]pyridin-3-yl}carbonyl)-2,4-difluorophenyl]propane-1-sulfonamide | PLX4720
TypeSmall organic molecule
Emp. Form.C17H14ClF2N3O3S
Mol. Mass.413.826
SMILESCCCS(=O)(=O)Nc1ccc(F)c(C(=O)c2c[nH]c3ncc(Cl)cc23)c1F