Reaction Details
TargetSerine/threonine-protein kinase B-raf
LigandBDBM35327
Substrate/Competitorn/a
Meas. Tech.ChEMBL_862419 (CHEMBL2173449)
IC50 2±n/a nM
Citation Wang, XKim, J Conformation-specific effects of Raf kinase inhibitors. J Med Chem55:7332-41 (2012) 
 
Serine/threonine-protein kinase B-raf
Name:Serine/threonine-protein kinase B-raf
Type:Serine/threonine-protein kinase
Mol. Mass.:84446.00
Organism:Homo sapiens (Human)
Description:P15056
Residue:766
BDBM35327
NameBDBM35327
Synonyms:pyridylpurine aminoisoquinoline, 1
TypeSmall organic molecule
Emp. Form.C26H19ClN8
Mol. Mass.478.936
SMILESCc1ccc2c(Nc3ccc(Cl)cc3)nccc2c1Nc1ncccc1-c1ncnc2nc[nH]c12