Reaction Details
TargetSerine/threonine-protein kinase B-raf
LigandBDBM25617
Substrate/Competitorn/a
Meas. Tech.ChEMBL_862422 (CHEMBL2173452)
Ki 2.6±n/a nM
Citation Wang, XKim, J Conformation-specific effects of Raf kinase inhibitors. J Med Chem55:7332-41 (2012) 
 
Serine/threonine-protein kinase B-raf
Name:Serine/threonine-protein kinase B-raf
Type:Serine/threonine-protein kinase
Mol. Mass.:84446.00
Organism:Homo sapiens (Human)
Description:P15056
Residue:766
BDBM25617
NameBDBM25617
Synonyms:N-[3-({5-chloro-1H-pyrrolo[2,3-b]pyridin-3-yl}carbonyl)-2,4-difluorophenyl]propane-1-sulfonamide | PLX4720
TypeSmall organic molecule
Emp. Form.C17H14ClF2N3O3S
Mol. Mass.413.826
SMILESCCCS(=O)(=O)Nc1ccc(F)c(C(=O)c2c[nH]c3ncc(Cl)cc23)c1F