Reaction Details
TargetSigma non-opioid intracellular receptor 1
LigandBDBM50396850
Substrate/Competitorn/a
Meas. Tech.ChEMBL_862690 (CHEMBL2174238)
Ki 0.25±n/a nM
Citation Meyer, CSchepmann, DYanagisawa, SYamaguchi, JDal Col, VLaurini, EItami, KPricl, SWünsch, B Pd-catalyzed direct C-H bond functionalization of spirocyclics1 ligands: generation of a pharmacophore model and analysis of the reverse binding mode by docking into a 3D homology model of thes1 receptor. J Med Chem55:8047-65 (2012) 
 
Sigma non-opioid intracellular receptor 1
Name:Sigma non-opioid intracellular receptor 1
Type:Protein
Mol. Mass.:25307.17
Organism:Cavia porcellus (Guinea pig)
Description:Q60492
Residue:223
BDBM50396850
NameBDBM50396850
Synonyms:CHEMBL2170496
TypeSmall organic molecule
Emp. Form.C26H26N2O2S
Mol. Mass.430.562
SMILESCOC1Cc2c(csc2-c2ccc(cc2)C#N)C2(CCN(Cc3ccccc3)CC2)O1