Reaction Details
TargetCannabinoid receptor 2
LigandBDBM50397390
Substrate/Competitorn/a
Meas. Tech.ChEMBL_864947 (CHEMBL2175897)
EC50 38.4±n/a nM
Citation El Bakali, JGilleron, PBody-Malapel, MMansouri, RMuccioli, GGDjouina, MBarczyk, AKlupsch, FAndrzejak, VLipka, EFurman, CLambert, DMChavatte, PDesreumaux, PMillet, R 4-Oxo-1,4-dihydropyridines as selective CB2 cannabinoid receptor ligands. Part 2: discovery of new agonists endowed with protective effect against experimental colitis. J Med Chem55:8948-52 (2012) 
 
Cannabinoid receptor 2
Name:Cannabinoid receptor 2
Type:G Protein-Coupled Receptor (GPCR)
Mol. Mass.:39690.94
Organism:Homo sapiens (Human)
Description:P34972
Residue:360
BDBM50397390
NameBDBM50397390
Synonyms:CHEMBL2170545
TypeSmall organic molecule
Emp. Form.C22H32N2O2
Mol. Mass.356.5017
SMILESCCCCCn1cc(C(=O)NC2C3CC4CC(C3)CC2C4)c(=O)cc1C