Reaction Details
TargetHistamine H1 receptor
LigandBDBM50397501
Substrate/Competitorn/a
Meas. Tech.ChEMBL_862026 (CHEMBL2173976)
Ki 50.12±n/a nM
Citation Bahl, ABarton, PBowers, KBrough, SEvans, RLuckhurst, CAMochel, TPerry, MWRigby, ARiley, RJSanganee, HSisson, ASpringthorpe, B The discovery of CCR3/H1 dual antagonists with reduced hERG risk. Bioorg Med Chem Lett22:6688-93 (2012) 
 
Histamine H1 receptor
Name:Histamine H1 receptor
Type:G Protein-Coupled Receptor (GPCR)
Mol. Mass.:55808.72
Organism:Homo sapiens (Human)
Description:Cell pellets from SK-N-MC cells transfected with human H1 receptor were used in binding assay.
Residue:487
BDBM50397501
NameBDBM50397501
Synonyms:CHEMBL2171039
TypeSmall organic molecule
Emp. Form.C23H26Cl3N3O4S
Mol. Mass.546.894
SMILESClc1ccc(OC2CCN(CC2)C2CCN(CC2)C(=O)NS(=O)(=O)c2ccccc2Cl)cc1Cl