Reaction Details
TargetHistamine H1 receptor
LigandBDBM50397512
Substrate/Competitorn/a
Meas. Tech.ChEMBL_862026 (CHEMBL2173976)
Ki 15.85±n/a nM
Citation Bahl, ABarton, PBowers, KBrough, SEvans, RLuckhurst, CAMochel, TPerry, MWRigby, ARiley, RJSanganee, HSisson, ASpringthorpe, B The discovery of CCR3/H1 dual antagonists with reduced hERG risk. Bioorg Med Chem Lett22:6688-93 (2012) 
 
Histamine H1 receptor
Name:Histamine H1 receptor
Type:G Protein-Coupled Receptor (GPCR)
Mol. Mass.:55808.72
Organism:Homo sapiens (Human)
Description:Cell pellets from SK-N-MC cells transfected with human H1 receptor were used in binding assay.
Residue:487
BDBM50397512
NameBDBM50397512
Synonyms:CHEMBL2171025
TypeSmall organic molecule
Emp. Form.C25H26Cl2N4O4
Mol. Mass.517.404
SMILESClc1ccc(OC2CCN(CC2)C2CCN(CC2)C(=O)c2ccc(cc2)-c2nc(=O)o[nH]2)cc1Cl