Reaction Details
TargetC-C chemokine receptor type 3
LigandBDBM50397484
Substrate/Competitorn/a
Meas. Tech.ChEMBL_862020 (CHEMBL2173970)
Ki 12.59±n/a nM
Citation Bahl, ABarton, PBowers, KBrough, SEvans, RLuckhurst, CAMochel, TPerry, MWRigby, ARiley, RJSanganee, HSisson, ASpringthorpe, B The discovery of CCR3/H1 dual antagonists with reduced hERG risk. Bioorg Med Chem Lett22:6688-93 (2012) 
 
C-C chemokine receptor type 3
Name:C-C chemokine receptor type 3
Type:Enzyme
Mol. Mass.:41053.88
Organism:Homo sapiens (Human)
Description:P51677
Residue:355
BDBM50397484
NameBDBM50397484
Synonyms:CHEMBL2171016
TypeSmall organic molecule
Emp. Form.C24H29Cl2N3O4S
Mol. Mass.526.476
SMILESCc1c(Cl)ccc(OC2CCN(CC2)C2CCN(CC2)S(=O)(=O)NC(=O)c2ccccc2)c1Cl