Reaction Details
TargetHistamine H1 receptor
LigandBDBM50397517
Substrate/Competitorn/a
Meas. Tech.ChEMBL_862026 (CHEMBL2173976)
Ki 25.12±n/a nM
Citation Bahl, ABarton, PBowers, KBrough, SEvans, RLuckhurst, CAMochel, TPerry, MWRigby, ARiley, RJSanganee, HSisson, ASpringthorpe, B The discovery of CCR3/H1 dual antagonists with reduced hERG risk. Bioorg Med Chem Lett22:6688-93 (2012) 
 
Histamine H1 receptor
Name:Histamine H1 receptor
Type:G Protein-Coupled Receptor (GPCR)
Mol. Mass.:55808.72
Organism:Homo sapiens (Human)
Description:Cell pellets from SK-N-MC cells transfected with human H1 receptor were used in binding assay.
Residue:487
BDBM50397517
NameBDBM50397517
Synonyms:CHEMBL2171020
TypeSmall organic molecule
Emp. Form.C26H27Cl2N3O3
Mol. Mass.500.417
SMILESClc1ccc(OC2CCN(CC2)C2CCN(CC2)C(=O)c2c[nH]c(=O)c3ccccc23)cc1Cl