Reaction Details
TargetPhosphatidylinositol 4,5-bisphosphate 3-kinase catalytic subunit gamma isoform
LigandBDBM92862
Substrate/Competitorn/a
Meas. Tech.ChEMBL_862299 (CHEMBL2173155)
IC50<10±n/a nM
Citation Rotella, DP Recent results in protein kinase inhibition for tropical diseases. Bioorg Med Chem Lett22:6788-93 (2012) 
 
Phosphatidylinositol 4,5-bisphosphate 3-kinase catalytic subunit gamma isoform
Name:Phosphatidylinositol 4,5-bisphosphate 3-kinase catalytic subunit gamma isoform
Type:Enzyme Subunit
Mol. Mass.:126470.30
Organism:Homo sapiens (Human)
Description:P48736
Residue:1102
BDBM92862
NameBDBM92862
Synonyms:US9284315, BEZ-235 | mTOR Inhibitor, BEZ235
TypeSmall molecule
Emp. Form.C30H23N5O
Mol. Mass.469.5365
SMILESCn1c2cnc3ccc(cc3c2n(-c2ccc(cc2)C(C)(C)C#N)c1=O)-c1cnc2ccccc2c1