Reaction Details
TargetCell division related protein kinase 2
LigandBDBM50397589
Substrate/Competitorn/a
Meas. Tech.ChEMBL_862287 (CHEMBL2173143)
IC50 5±n/a nM
Citation Rotella, DP Recent results in protein kinase inhibition for tropical diseases. Bioorg Med Chem Lett22:6788-93 (2012) 
 
Cell division related protein kinase 2
Name:Cell division related protein kinase 2
Type:PROTEIN
Mol. Mass.:35647.04
Organism:Leishmania major
Description:ChEMBL_862288
Residue:311
BDBM50397589
NameBDBM50397589
Synonyms:CHEMBL2171517
TypeSmall organic molecule
Emp. Form.C24H29N3O
Mol. Mass.375.5066
SMILESCc1cc(C)cc(c1)-c1ccc2nc(NC(=O)C3CCCCCC3)n(C)c2c1