Reaction Details
TargetCell division related protein kinase 2
LigandBDBM50397591
Substrate/Competitorn/a
Meas. Tech.ChEMBL_862287 (CHEMBL2173143)
IC50 510±n/a nM
Citation Rotella, DP Recent results in protein kinase inhibition for tropical diseases. Bioorg Med Chem Lett22:6788-93 (2012) 
 
Cell division related protein kinase 2
Name:Cell division related protein kinase 2
Type:PROTEIN
Mol. Mass.:35647.04
Organism:Leishmania major
Description:ChEMBL_862288
Residue:311
BDBM50397591
NameBDBM50397591
Synonyms:CHEMBL2171515
TypeSmall organic molecule
Emp. Form.C17H18N2O4S
Mol. Mass.346.401
SMILESCCN(Cc1ccc(\C=C2/C(=O)Nc3ccccc23)o1)S(C)(=O)=O