Reaction Details
TargetCell division related protein kinase 2
LigandBDBM47658
Substrate/Competitorn/a
Meas. Tech.ChEMBL_862287 (CHEMBL2173143)
IC50 1500±n/a nM
Citation Rotella, DP Recent results in protein kinase inhibition for tropical diseases. Bioorg Med Chem Lett22:6788-93 (2012) 
 
Cell division related protein kinase 2
Name:Cell division related protein kinase 2
Type:PROTEIN
Mol. Mass.:35647.04
Organism:Leishmania major
Description:ChEMBL_862288
Residue:311
BDBM47658
NameBDBM47658
Synonyms:1-(4-methylphenyl)-3-(2-pyridin-3-ylpyrimidin-4-yl)urea 1-(p-tolyl)-3-[2-(3-pyridyl)pyrimidin-4-yl]urea N-(4-methylphenyl)-N'-[2-(3-pyridinyl)-4-pyrimidinyl]urea cid_1477566
TypeSmall organic molecule
Emp. Form.C17H15N5O
Mol. Mass.305.3339
SMILESCc1ccc(NC(=O)Nc2ccnc(n2)-c2cccnc2)cc1