Reaction Details
TargetCell division related protein kinase 2
LigandBDBM50397593
Substrate/Competitorn/a
Meas. Tech.ChEMBL_862287 (CHEMBL2173143)
IC50 260±n/a nM
Citation Rotella, DP Recent results in protein kinase inhibition for tropical diseases. Bioorg Med Chem Lett22:6788-93 (2012) 
 
Cell division related protein kinase 2
Name:Cell division related protein kinase 2
Type:PROTEIN
Mol. Mass.:35647.04
Organism:Leishmania major
Description:ChEMBL_862288
Residue:311
BDBM50397593
NameBDBM50397593
Synonyms:CHEMBL2171513
TypeSmall organic molecule
Emp. Form.C24H23N5O2
Mol. Mass.413.4717
SMILESCC(=O)c1cccc(c1)-c1cnn2ccc(Nc3ccc(cc3)N3CCOCC3)nc12