Reaction Details
TargetMetabotropic glutamate receptor 2
LigandBDBM50397661
Substrate/Competitorn/a
Meas. Tech.ChEMBL_873324 (CHEMBL2185177)
EC50 11.1±n/a nM
Citation Wang, JQZhang, ZKuruppu, DBrownell, AL Radiosynthesis of PET radiotracer as a prodrug for imaging group II metabotropic glutamate receptors in vivo. Bioorg Med Chem Lett22:1958-62 (2012) 
 
Metabotropic glutamate receptor 2
Name:Metabotropic glutamate receptor 2
Type:Enzyme
Mol. Mass.:95584.88
Organism:Homo sapiens (Human)
Description:Q14416
Residue:872
BDBM50397661
NameBDBM50397661
Synonyms:EGLUMEGAD
TypeSmall organic molecule
Emp. Form.C8H11NO4
Mol. Mass.185.1772
SMILESN[C@]1(CC[C@H]2[C@@H]([C@@H]12)C(O)=O)C(O)=O