Reaction Details
TargetAdenosine receptor A1
LigandBDBM50117109
Substrate/Competitorn/a
Meas. Tech.ChEMBL_874129 (CHEMBL2187070)
Ki 350±n/a nM
Citation Baraldi, PGPreti, DBorea, PAVarani, K Medicinal chemistry of A3 adenosine receptor modulators: pharmacological activities and therapeutic implications. J Med Chem55:5676-703 (2012) 
 
Adenosine receptor A1
Name:Adenosine receptor A1
Type:G Protein-Coupled Receptor (GPCR)
Mol. Mass.:36520.92
Organism:Homo sapiens (Human)
Description:P30542
Residue:326
BDBM50117109
NameBDBM50117109
Synonyms:1-(2-Furan-2-yl-8-methyl-8H-pyrazolo[4,3-e][1,2,4]triazolo[1,5-c]pyrimidin-5-yl)-3-pyridin-4-yl-urea CHEMBL332091
TypeSmall organic molecule
Emp. Form.C17H13N9O2
Mol. Mass.375.3442
SMILESCn1cc2c(n1)nc(NC(=O)Nc1ccncc1)n1nc(nc21)-c1ccco1